Projekt
type: EntityType
type: Function
type: Class
page: 127
page: 201
page: 32
chapter: CONTR
chapter: SPLAN
chapter: STELL
consolidated: false
consolidated: true
is associated with: Projektabwicklung
label: project @en
subclass of: ControllingObjekt
definition: Projekt wird dabei als zielgerichtetes klar definiertes zeitlich begrenztes durch Größe Bedeutung Komplexität Neuartigkeit Einmaligkeit Kosten und Risiko gekennzeichnetes Vorhaben verstanden (vgl. DIN 69901).
definition: z.B. Entwicklungsprojekte Wartungsprojekte