Prozessorientierung
type: EntityType
type: Class
page: 153
chapter: QUALM
consolidated: false
label: Process Orientation @en
subclass of: QualitaetsmerkmalganzheitlicheSicht
definition: Ausrichtung eines Unternehmens primär an Geschäftsprozessen statt an Funktionalbereichen.
definition: Ein erwünschtes Ergebnis lässt sich effizienter erreichen wenn Aufgaben in Form von Prozessen geplant gesteuert und kontrolliert werden.