Qualitätsmanagement
type: Class
type: Function
label: QM @en
label: quality management @en
subclass of: ItGovernanceAufgabe
chapter: INBAN
chapter: GOVER
chapter: QUALM
chapter: PERSM
definition: In der ISO-9000-Normenfamilie wird QM als aufeinander abgestimmte Tätigkeiten zum Leiten und Lenken einer Organisation bezüglich Qualität bezeichnet.
updates: ItGovernance
updates: Personalqualifikation
updates: Qualitaetspolitik
updates: Qualitaetsstrategie
updates: Rahmenkonzept
updates: ServiceebenenVereinbarung
updates: StrategischesQualitaetsziel
updates: Vorgehensmodell
uses: Dienstleistung
uses: Produkt
uses: Architektur
uses: Dokumentation
uses: Informationsinfrastruktur
uses: MethodederQualitaetsplanung
uses: MethodederQualitaetspruefung
uses: Prozess
uses: Qualitaetsmanagementsystem
function component: Qualitaetslenkung
function component: Qualitaetsplanung
function component: Qualitaetspruefung
function component: Qualitaetssicherung
function component: Qualitaetsverbesserung
consolidated: true
consolidated: false
page: 58
page: 156
page: 240
page: 150
page: 154
page: 151
page: 158
page: 484
page: 149