Räumliche Infrastruktur
type: EntityType
type: Class
page: 19
chapter: ERMOD
consolidated: true
label: physical infrastructure @en
subclass of: EntityType
definition: bspw. Standorte und Architektur von Rechenzentren