Referenzmodell
type: Class
type: EntityType
label: Reference Model @en
label: reference model @en
subclass of: Modell
subclass of: Entwurfsmuster
chapter: ERMOD
definition: 1. eine zweckorientierte Spezifikation des generellen Modellbegriffs die als Vorlage für das Gestalten von Artefakten dient (Lerneinheit ERMOD). 2. Modell das einen gewollten oder geplanten Zustand eines Systems abbildet an dem dessen gegenwärtiger Zustand beurteilt werden kann oder ein Modell das als Vorbild zur Ableitung eines spezifischen Modells dient (Lerneinheit GPMAN).
definition: Referenzmodelle sind Entwurfsmuster die als idealtypisch für die Klasse der zu modellierenden Phänomene angesehen werden. Mit anderen Worten handelt es sich um generische Rahmenwerke (Frameworks) die an spezifische Situationen angepasst werden. Eine zweckorientierte Spezifikation des generellen Modellbegriffs die als Vorlage für das Gestalten von Artefakten dient.
consolidated: true
consolidated: false
page: 29
page: 17