Reifegradmodell
type: EntityType
type: Class
page: 152
page: 157
page: 489
page: 59
chapter: GOVER
chapter: INBAN
chapter: QUALM
consolidated: false
consolidated: true
is associated with: Prozess
is associated with: Prozessqualitaetskriterium
is associated with: Reife
label: capability maturity model @en
subclass of: MethodeDerQualitaetsverbesserung
subclass of: Modell
definition: Reifegradmodelle (vgl. Lerneinheit MEQUA) dienen zur Bestimmung der Reife einer Aufgabe und geben Hinweise für deren Weiterentwicklung.