Sicherheitsmanagement
type: Function
type: Class
page: 58
chapter: GOVER
consolidated: false
consolidated: true
uses: Abrechnungssystem
uses: Architektur
label: Security Management @en
subclass of: ItGovernanceAufgabe
definition: Gesamtheit der Führungsaufgaben die sich mit Sicherheit der Informationsinfrastruktur befassen.