Softwarearchitektur
type: EntityType
type: Class
page: 43
page: 46
chapter: ARCHI
consolidated: false
consolidated: true
is associated with: Gestaltungsziel
is associated with: Konstruktionsregel
is associated with: Softwaresystem
label: Software Architecture @en
label: software architecture @en
subclass of: Teilarchitektur
definition: Modell der Komponenten eines Softwaresystems sowie deren Schnittstellen und Beziehungen untereinander sowie zum Systemumfeld.
definition: Modell der Komponenten eines Softwaresystems sowie deren Schnittstellen und Beziehungen untereinander sowie zum Systemumfeld. Eine Softwarearchitektur umfasst die Komponenten eines Softwaresystems sowie deren Schnittstellen und Beziehungen untereinander sowie zum Systemumfeld.