Strategieobjekt
type: EntityType
type: Class
page: 114
chapter: STRAT
consolidated: true
subclass of: EntityType
definition: Strategieobjekte sind die Komponenten der Informationsinfrastruktur (z.B. Datenstrukturen Architekturen Vorgehensmodelle als logische Komponenten Hardware Software Personal als physische Komponenten) und wesentliche Eigenschaften der Infrastruktur (z.B. Outsourcing-Grad Integrationsgrad Verteilung) insbesondere Eigenschaften mit strategischem Zielcharakter (z.B. Wirksamkeit Wirtschaftlichkeit Sicherheit).