Strategisches IT-Ziel
type: EntityType
type: Class
page: 103
chapter: SZIEL
consolidated: true
is based on: StrategischesUnternehmensziel
label: strategic IT objective @en
subclass of: Ziel
definition: Ziel das die langfristige unternehmensweite und den Wettbewerb positiv beeinflussende Veränderungen der IT lenkt.