Totalitätsprinzip
type: EntityType
type: Class
page: 153
chapter: QUALM
consolidated: false
subclass of: QualitaetsmerkmalganzheitlicheSicht
definition: Alle Mitglieder eines Unternehmens streben danach dass alle Elemente des Unternehmens (Strukturen und Abläufe Produkte Projekte und Prozesse) permanent alle relevanten Anforderungen erfüllen.