Unternehmenskultur
type: EntityType
type: Class
page: 126
page: 288
chapter: SPLAN
chapter: WIMAN
consolidated: false
label: Corporate Culture @en
subclass of: EntityType
definition: Muster von Prämissen (z. B. Normen Werte und Wahrnehmungen) das von den Unternehmensmitgliedern im Umgang mit der externen und internen Umwelt erlernt und durch Sozialisation weitergegeben wird.