Vereinbarung von Abrechnungsmodell
type: EntityType
type: Class
page: 299
chapter: VERMAN
consolidated: false
subclass of: Vertragszweck
definition: Vereinbarung von Abrechnungsmodellen zur Ermittlung des Entgelts je Abrechnungszeitraum einschließlich Zahlungsbedingungen.