Wirksamkeitsstreben
type: EntityType
type: Class
page: 107
page: 115
page: 23
chapter: ERMOD
consolidated: true
label: effectivity @en
subclass of: StrategischesFormalzielTZ
definition: Wirksamkeit ist die Eigenschaft eines Objekts / der IT Funktionen und Leistung zur Aufgabenerfüllung zur Verfügung zu stellen unabhängig von den dafür erforderlichen Kosten und dem dadurch realisierbaren Nutzen (Effektivität).