Wirtschaftlichkeit
type: EntityType
type: Class
page: 130
page: 131
chapter: SPLAN
consolidated: false
label: Efficiency @en
subclass of: Evaluierungskriterium
subclass of: strategischerEinflussfaktor
definition: Verhältnis von Nutzen und Kosten eines Objekts.