Workflow Reference Model
type: EntityType
type: Class
page: 439
chapter: INBAN
consolidated: false
subclass of: Referenzmodell
definition: Es erlaubt die Beschreibung von Schnittstellen in Workflow-Managementsystemen.