entity type
type: Class
comment: An entity type is any kind of information that is consumed, produced or modified by a task. These can be documents, data structures, objects, roles, specified by data types or even paper based artifacts.
label: Objekttyp @de
subclass of: Top
disjoint with: Function
disjoint with: Role