approves
type: ObjectProperty
comment: Die Rolle stimmt der Aufgabe zu Aufgabe oder kann potenziell diese Zustimmung geben. @de
comment: The role approves the Function or can potentially approve it.
domain: Role
range: Function
sub property of: approves